{"text_format":"1","workbook":"xlsx","n_sheets":8,"sheets":["1階換気経路","1階換気経路 (LA)","1階換気経路(A3用)","入力例","換気量計算 機種選定書","注意書","配線図","項目関係"],"not_rendered":{"charts":0,"images":6,"macros":1,"external_links":1,"defined_names":16,"comments":2,"pivot_tables":0},"unopened":[],"bounds":{"document_bytes":16777216,"sheet_cells":100000,"rows_first":2000,"rows_last":500,"rows_between":2000,"halvings":0,"cell_chars":16384,"cell_head_chars":4096},"cells_cut":0,"cells_raw":0,"read":"whole","date_system":"1900"}

{"sheet":"1階換気経路","index":0,"n_rows":53,"n_cols":19,"rows_kept":53,"cut":false,"hidden":true,"merged":[[38,14,38,15],[44,13,44,14],[44,1,44,6],[44,7,44,8],[44,10,44,11],[42,12,42,15],[43,12,43,15],[41,12,41,15]]}
[]
[]
[]
[]
[]
[]
[]
[]
[]
[]
[]
[]
[]
[]
[]
[]
[]
[]
[]
[]
[]
[]
[null,null,null,null,null,null,null,null,null,null,null,null,null,null,"凡例"]
[]
[null,null,null,null,null,null,null,null,null,null,null,null,null,null,"ドア等の通気"]
[]
[null,null,null,null,null,null,null,null,null,null,null,null,null,null,"第一種換気機(排気)"]
[]
[null,null,null,null,null,null,null,null,null,null,null,null,null,null,"第一種換気機(給気)"]
[]
[null,null,null,null,null,null,null,null,null,null,null,null,null,null,"局所換気",null,"⇔必要に応じ変更⇔",null,"第三種換気機"]
[]
[null,null,null,null,null,null,null,null,null,null,null,null,null,null,"自然給気口"]
[]
[null,null,null,null,null,null,null,null,null,null,null,null,null,null,"通気グリル"]
[]
[null,null,null,null,null,null,null,null,null,null,null,null,null,null,"24時間換気対象外"]
[]
[null,null,null,null,null,null,null,null,null,null,null,null,null,null,"当該全般換気対象外"]
[]
[]
[null,null,null,null,null,null,null,null,null,null,null,null,"※LT-50Eco：風量切替スイッチは、壁面に設置　　"]
[null,null,null,null,null,null,null,null,null,null,null,null,"※LT-50Pro：風量切替は、ワイヤレスリモコンで行う　"]
[null,null,null,null,null,null,null,null,null,null,null,null,"※LA-60：風量切替スイッチは、壁面に設置　　"]
["工事名　：",{"$f":"IF('換気量計算 機種選定書'!C3=\"\",\"\",'換気量計算 機種選定書'!C3)","v":"様邸"},null,null,null,null,null,"1階換気経路",null,"縮尺　：","noscale",null,"日付　：",{"$f":"'換気量計算 機種選定書'!J1","v":"2019/"}]
[null,null,null,null,null,null,null,"※床下通気措置の為、別途床面設置ガラリ等を設ける"]
[null,null,null,null,null,null,null,"※床下空間と居住空間は通気のない仕様とする事"]
[]
[]
[]
[]
[null,"よこ",1.089,null,{"$f":"C52*D52","v":0}]
[null,"たて",1.1120000000000001,null,{"$f":"C53*D53","v":0}]

{"sheet":"1階換気経路 (LA)","index":1,"n_rows":45,"n_cols":15,"rows_kept":45,"cut":false,"hidden":true,"merged":[[44,1,44,6],[44,7,44,8],[44,10,44,11],[44,13,44,14]]}
[]
[]
[]
[]
[]
[]
[]
[]
[]
[]
[]
[]
[]
[]
[]
[]
[]
[]
[]
[]
[]
[]
[]
[]
[]
[]
[null,null,null,null,null,null,null,null,null,null,null,null,null,null,"凡例"]
[]
[null,null,null,null,null,null,null,null,null,null,null,null,null,null,"排気ダクトφ100"]
[]
[null,null,null,null,null,null,null,null,null,null,null,null,null,null,"屋外排気フード"]
[]
[null,null,null,null,null,null,null,null,null,null,null,null,null,null,"ドア等の通気"]
[]
[null,null,null,null,null,null,null,null,null,null,null,null,null,null,"排気機"]
[]
[null,null,null,null,null,null,null,null,null,null,null,null,null,null,"排気機"]
[]
[null,null,null,null,null,null,null,null,null,null,null,null,null,null,"給気グリル"]
[]
[null,null,null,null,null,null,null,null,null,null,null,null,null,null,"風量切替スイッチ"]
[]
[null,null,null,null,null,null,null,null,null,null,null,null,null,null,"24時間換気対象外"]
[]
["邸名　：",{"$f":"'換気量計算 機種選定書'!C3","v":"様邸"},null,null,null,null,null,"1階換気経路",null,"縮尺　：","noscale",null,"日付　：",{"$f":"'換気量計算 機種選定書'!J1","v":"2019/"}]

{"sheet":"1階換気経路(A3用)","index":2,"n_rows":65,"n_cols":26,"rows_kept":65,"cut":false,"hidden":true,"merged":[[58,21,58,22],[62,1,62,13],[62,14,62,15],[62,17,62,18],[62,20,62,21],[60,19,60,22],[61,19,61,22]]}
[]
[]
[]
[]
[]
[]
[]
[]
[]
[]
[]
[]
[]
[]
[]
[]
[]
[]
[]
[]
[]
[]
[]
[]
[]
[]
[]
[]
[]
[]
[]
[]
[]
[]
[]
[]
[]
[]
[]
[]
[null,null,null,null,null,null,null,null,null,null,null,null,null,null,null,null,null,null,null,null,null,"凡例"]
[]
[null,null,null,null,null,null,null,null,null,null,null,null,null,null,null,null,null,null,null,null,null,"ドア等の通気"]
[]
[null,null,null,null,null,null,null,null,null,null,null,null,null,null,null,null,null,null,null,null,null,"第一種換気機(排気)"]
[]
[null,null,null,null,null,null,null,null,null,null,null,null,null,null,null,null,null,null,null,null,null,"第一種換気機(給気)"]
[]
[null,null,null,null,null,null,null,null,null,null,null,null,null,null,null,null,null,null,null,null,null,"局所換気",null,"⇔必要に応じ変更⇔",null,"第三種換気機"]
[]
[null,null,null,null,null,null,null,null,null,null,null,null,null,null,null,null,null,null,null,null,null,"給気グリル"]
[]
[null,null,null,null,null,null,null,null,null,null,null,null,null,null,null,null,null,null,null,null,null,"通気グリル"]
[]
[null,null,null,null,null,null,null,null,null,null,null,null,null,null,null,null,null,null,null,null,null,"風量切替スイッチ"]
[]
[null,null,null,null,null,null,null,null,null,null,null,null,null,null,null,null,null,null,null,null,null,"24時間換気対象外"]
[]
[null,null,null,null,null,null,null,null,null,null,null,null,null,null,null,null,null,null,null,null,null,"当該全般換気対象外"]
[]
{"$rows_left_out":6}
{"sheet":"入力例","index":3,"n_rows":49,"n_cols":13,"rows_kept":49,"cut":false,"hidden":false,"merged":[[2,0,2,1],[2,2,2,6],[2,7,2,8],[0,0,0,6],[0,7,0,8],[1,0,1,1],[1,2,1,6],[1,7,1,8],[5,0,5,6],[5,8,5,12],[6,0,6,1],[6,8,8,8],[6,9,8,9],[6,10,7,10],[6,11,6,12],[7,0,7,1],[35,1,36,2],[35,3,36,3],[35,4,36,4],[37,1,38,2],[37,3,38,3],[37,4,38,4],[39,1,40,2],[39,3,40,3],[39,4,40,4],[41,1,42,2],[41,3,42,4]]}
["機種選定書",null,null,null,null,null,null,"作成日",null,"2020-01-01"]
["ビルダー名",null,"○○○建設株式会社",null,null,null,null,"換気の分類",null,"第一種"]
["工事名",null,"サンプル　様邸"]
[]
["換気量計算書",null,null,null,null,null,null,null,"機種選定書"]
["住宅情報",null,null,null,null,null,null,null,"換気機機材仕様"]
[null,null,null,"平均",null,"必要換気回数","必要換気量",null,"品名","型番","台数","計画換気量"]
["室名",null,"対象面積","天井高","気積","回数","（A）",null,null,null,null,"給気量","排気量"]
[null,null,"[m2]","[m]","[m3]","[n/h]","[m3/h]",null,null,null,"[台]","[m3/h]","[m3/h]"]
["1階","ＬＤ･キッチン",41.405000000000001,2.7,{"$f":"IF(B10=\"\",\"\",ROUNDDOWN(C10*D10,4))","v":111.79349999999999},{"$f":"IF(B10=\"\",\"\",\"0.50\")","v":"0.50"},{"$f":"IF(B10=\"\",\"\",ROUND(E10*F10,4))","v":55.896799999999999},null,{"$f":"IF(AND(J10=\"\",K10=\"\"),\"\",IF(J10=\"\",\"給気口\",INDEX(項目関係!$F$6:$F$44,MATCH(J10,項目関係!$G$6:$G$44,0))))","v":"換気機"},"LT-50EcoFlatS/W/B/CB",2]
["1階","洋室Ａ",16.562000000000001,2.5,{"$f":"IF(B11=\"\",\"\",ROUNDDOWN(C11*D11,4))","v":41.405000000000001},"0.50",{"$f":"IF(B11=\"\",\"\",ROUND(E11*F11,4))","v":20.702500000000001},null,{"$f":"IF(AND(J11=\"\",K11=\"\"),\"\",IF(J11=\"\",\"給気口\",INDEX(項目関係!$F$6:$F$44,MATCH(J11,項目関係!$G$6:$G$44,0))))","v":"換気機"},"LT-50EcoFlatS/W/B/CB",1]
["1階","ホール",4.9686000000000003,2.5,12.4215,"0.50",6.2107999999999999,null,{"$f":"IF(AND(J12=\"\",K12=\"\"),\"\",IF(J12=\"\",\"給気口\",INDEX(項目関係!$F$6:$F$44,MATCH(J12,項目関係!$G$6:$G$44,0))))","v":"換気機"},"LT-50EcoFlatS/W/B/CB",1]
["1階","玄関",4.9686000000000003,2.7,13.4152,"0.50",6.7076000000000002,null,{"$f":"IF(AND(J13=\"\",K13=\"\"),\"\",IF(J13=\"\",\"給気口\",INDEX(項目関係!$F$6:$F$44,MATCH(J13,項目関係!$G$6:$G$44,0))))","v":""}]
["1階","階段",2.9834999999999998,2.5,7.4587000000000003,"0.50",3.7294,null,{"$f":"IF(AND(J14=\"\",K14=\"\"),\"\",IF(J14=\"\",\"給気口\",INDEX(項目関係!$F$6:$F$44,MATCH(J14,項目関係!$G$6:$G$44,0))))","v":""}]
["2階","洋室Ｂ",13.249599999999999,2.5,33.124000000000002,"0.50",16.562000000000001,null,{"$f":"IF(AND(J15=\"\",K15=\"\"),\"\",IF(J15=\"\",\"給気口\",INDEX(項目関係!$F$6:$F$44,MATCH(J15,項目関係!$G$6:$G$44,0))))","v":"換気機"},"LT-50EcoFlatS/W/B/CB",1]
["2階","ＷＣＬ",4.9686000000000003,2.5,12.4215,"0.50",6.2107999999999999,null,{"$f":"IF(AND(J16=\"\",K16=\"\"),\"\",IF(J16=\"\",\"給気口\",INDEX(項目関係!$F$6:$F$44,MATCH(J16,項目関係!$G$6:$G$44,0))))","v":""}]
["2階","洋室Ｃ",14.3416,2.5,35.853999999999999,"0.50",17.927,null,{"$f":"IF(AND(J17=\"\",K17=\"\"),\"\",IF(J17=\"\",\"給気口\",INDEX(項目関係!$F$6:$F$44,MATCH(J17,項目関係!$G$6:$G$44,0))))","v":"換気機"},"LT-50EcoFlatS/W/B/CB",1]
["2階","洋室Ｄ",14.3416,2.5,35.853999999999999,"0.50",17.927,null,{"$f":"IF(AND(J18=\"\",K18=\"\"),\"\",IF(J18=\"\",\"給気口\",INDEX(項目関係!$F$6:$F$44,MATCH(J18,項目関係!$G$6:$G$44,0))))","v":"換気機"},"LT-50EcoFlatS/W/B/CB",1]
["2階","ホール",4.9686000000000003,2.5,12.4215,"0.50",6.2107999999999999,null,{"$f":"IF(AND(J19=\"\",K19=\"\"),\"\",IF(J19=\"\",\"給気口\",INDEX(項目関係!$F$6:$F$44,MATCH(J19,項目関係!$G$6:$G$44,0))))","v":"換気機"},"LT-50EcoFlatS/W/B/CB",1]
["2階","吹抜",20.702500000000001,3.05,63.142600000000002,"0.50",31.571300000000001,null,{"$f":"IF(AND(J20=\"\",K20=\"\"),\"\",IF(J20=\"\",\"給気口\",INDEX(項目関係!$F$6:$F$44,MATCH(J20,項目関係!$G$6:$G$44,0))))","v":""}]
["2階","階段",3.3123999999999998,3.05,10.1028,"0.50",5.0514000000000001,null,{"$f":"IF(AND(J21=\"\",K21=\"\"),\"\",IF(J21=\"\",\"給気口\",INDEX(項目関係!$F$6:$F$44,MATCH(J21,項目関係!$G$6:$G$44,0))))","v":""}]
[null,null,null,null,"","","",null,{"$f":"IF(AND(J22=\"\",K22=\"\"),\"\",IF(J22=\"\",\"給気口\",INDEX(項目関係!$F$6:$F$44,MATCH(J22,項目関係!$G$6:$G$44,0))))","v":""}]
[null,null,null,null,"","","",null,{"$f":"IF(AND(J23=\"\",K23=\"\"),\"\",IF(J23=\"\",\"給気口\",INDEX(項目関係!$F$6:$F$44,MATCH(J23,項目関係!$G$6:$G$44,0))))","v":""}]
[null,null,null,null,"","","",null,{"$f":"IF(AND(J24=\"\",K24=\"\"),\"\",IF(J24=\"\",\"給気口\",INDEX(項目関係!$F$6:$F$44,MATCH(J24,項目関係!$G$6:$G$44,0))))","v":""}]
[null,null,null,null,"","","",null,{"$f":"IF(AND(J25=\"\",K25=\"\"),\"\",IF(J25=\"\",\"給気口\",INDEX(項目関係!$F$6:$F$44,MATCH(J25,項目関係!$G$6:$G$44,0))))","v":""}]
[null,null,null,null,"","","",null,{"$f":"IF(AND(J26=\"\",K26=\"\"),\"\",IF(J26=\"\",\"給気口\",INDEX(項目関係!$F$6:$F$44,MATCH(J26,項目関係!$G$6:$G$44,0))))","v":""}]
[null,null,null,null,"","","",null,{"$f":"IF(AND(J27=\"\",K27=\"\"),\"\",IF(J27=\"\",\"給気口\",INDEX(項目関係!$F$6:$F$44,MATCH(J27,項目関係!$G$6:$G$44,0))))","v":""}]
[null,null,null,null,"","","",null,{"$f":"IF(AND(J28=\"\",K28=\"\"),\"\",IF(J28=\"\",\"給気口\",INDEX(項目関係!$F$6:$F$44,MATCH(J28,項目関係!$G$6:$G$44,0))))","v":""}]
[null,null,null,null,"","","",null,{"$f":"IF(AND(J29=\"\",K29=\"\"),\"\",IF(J29=\"\",\"給気口\",INDEX(項目関係!$F$6:$F$44,MATCH(J29,項目関係!$G$6:$G$44,0))))","v":""}]
[null,null,null,null,"","","",null,{"$f":"IF(AND(J30=\"\",K30=\"\"),\"\",IF(J30=\"\",\"給気口\",INDEX(項目関係!$F$6:$F$44,MATCH(J30,項目関係!$G$6:$G$44,0))))","v":""}]
[null,null,null,null,"","","",null,{"$f":"IF(AND(J31=\"\",K31=\"\"),\"\",IF(J31=\"\",\"給気口\",INDEX(項目関係!$F$6:$F$44,MATCH(J31,項目関係!$G$6:$G$44,0))))","v":""}]
[null,null,null,null,"","","",null,{"$f":"IF(AND(J32=\"\",K32=\"\"),\"\",IF(J32=\"\",\"給気口\",INDEX(項目関係!$F$6:$F$44,MATCH(J32,項目関係!$G$6:$G$44,0))))","v":""}]
["合計",null,{"$f":"SUM(C10:C32)","v":146.77260000000001},null,{"$f":"SUM(E10:E32)","v":389.41430000000003},null,{"$f":"SUM(G10:G32)","v":194.70740000000001},null,null,null,{"$f":"SUM(K10:K32)","v":8},{"$f":"$K$33*25","v":200},{"$f":"$K$33*25","v":200}]
[null,null,null,null,null,null,null,null,"※上記計画換気量計算は、第一種換気の普通換気運転時を想定しています。"]
["換気量の判定",null,null,null,null,null,null,null,"※壁付第一種熱交換換気機(ツインエアーフレッシュLT-50シリーズ)を熱交換"]
[null,"必要換気量",null,{"$f":"G33","v":194.71},"㎥/ｈ",null,null,null,"※運転で使用した場合は、約70秒毎に排気と給気が入れ替わりますが、計画"]
[null,null,null,null,null,null,null,null,"※換気量は普通換気運転時と同一となります。"]
[null,"計画換気量",null,{"$f":"M33","v":200},"㎥/ｈ"]
[]
[null,"換気回数",null,{"$f":"M33/E33","v":0.51},"回/ｈ"]
[]
[null,"換気判定",null,{"$f":"IF(M33/E33>=0.5,\"○\",\"×\")","v":"○"}]
[]
[null,"　※判定説明【○：必要換気量を満足する　×：必要換気量を満足しない】"]
["※本資料は平成15年7月1日現在の建築基準法に準拠したものです。実際に申請、施工を行う際はその時点の建築基準法をご確認ください。"]
["※ダクトレスタイプの換気機は床下空間へは設置できませんので、当該部の換気を行う場合はダクト式の換気機を使用してください。"]
["※洗面室,トイレ等の水廻り空間を換気する場合は、別途局所換気設備を設けてください。"]
["※物入れ、押入れ等を換気区域から除外する場合は建具の構造を空気の流通のない物としてください。"]
["※床下、小屋裏空間の強制換気を行わない場合はホルムアルデヒド発散建材の種類、面積をご確認ください。"]

{"sheet":"換気量計算 機種選定書","index":4,"n_rows":70,"n_cols":13,"rows_kept":70,"cut":false,"hidden":false,"merged":[[52,0,52,12],[69,10,69,12],[53,0,54,1],[53,3,54,3],[53,4,54,4],[53,5,54,5],[53,6,54,9],[53,10,54,12],[68,6,68,9],[69,6,69,9],[55,10,55,12],[56,10,56,12],[57,10,57,12],[58,10,58,12],[59,10,59,12],[60,10,60,12],[61,10,61,12],[62,10,62,12],[63,10,63,12],[64,10,64,12],[65,10,65,12],[66,10,66,12],[67,10,67,12],[68,10,68,12],[55,6,55,9],[56,6,56,9],[57,6,57,9],[58,6,58,9],[59,6,59,9],[60,6,60,9],[61,6,61,9],[62,6,62,9],[63,6,63,9],[64,6,64,9],[65,6,65,9],[66,6,66,9],[67,6,67,9],[41,1,42,2],[41,3,42,4],[39,3,40,3],[35,3,36,3],[35,1,36,2],[37,1,38,2],[37,3,38,3],[39,4,40,4],[35,4,36,4],[37,4,38,4],[39,1,40,2],[1,0,1,1],[2,0,2,1],[0,7,0,8],[1,7,1,8],[0,0,0,6],[1,2,1,6],[2,2,2,6],[6,8,8,8],[2,7,2,8],[6,11,6,12],[5,8,5,12],[5,0,5,6],[6,0,6,1],[7,0,7,1],[6,10,7,10],[6,9,8,9]]}
["機種選定書",null,null,null,null,null,null,"作成日",null,"2019/"]
["ビルダー名",null,null,null,null,null,null,"換気の分類",null,"第一種"]
["工事名",null,"様邸"]
[]
["換気量計算書",null,null,null,null,null,null,null,"機種選定書"]
["住宅情報",null,null,null,null,null,null,null,"換気機機材仕様"]
[null,null,null,"平均",null,"必要換気回数","必要換気量",null,"品名","型番","台数","計画換気量"]
["室名",null,"対象面積","天井高","気積","回数","（A）",null,null,null,null,"給気量","排気量"]
[null,null,"[m2]","[m]","[m3]","[n/h]","[m3/h]",null,null,null,"[台]","[m3/h]","[m3/h]"]
["1階",null,null,null,{"$f":"IF(B10=\"\",\"\",ROUNDDOWN(C10*D10,4))","v":""},{"$f":"IF(B10=\"\",\"\",\"0.50\")","v":""},{"$f":"IF(B10=\"\",\"\",ROUND(E10*F10,4))","v":""},null,{"$f":"IF(AND(J10=\"\",K10=\"\"),\"\",IF(J10=\"\",\"給気口\",INDEX(項目関係!$F$6:$F$44,MATCH(J10,項目関係!$G$6:$G$44,0))))","v":""}]
[null,null,null,null,{"$f":"IF(B11=\"\",\"\",ROUNDDOWN(C11*D11,4))","v":""},{"$f":"IF(B11=\"\",\"\",\"0.50\")","v":""},{"$f":"IF(B11=\"\",\"\",ROUND(E11*F11,4))","v":""},null,{"$f":"IF(AND(J11=\"\",K11=\"\"),\"\",IF(J11=\"\",\"給気口\",INDEX(項目関係!$F$6:$F$44,MATCH(J11,項目関係!$G$6:$G$44,0))))","v":""}]
[null,null,null,null,"","","",null,{"$f":"IF(AND(J12=\"\",K12=\"\"),\"\",IF(J12=\"\",\"給気口\",INDEX(項目関係!$F$6:$F$44,MATCH(J12,項目関係!$G$6:$G$44,0))))","v":""}]
[null,null,null,null,"","","",null,{"$f":"IF(AND(J13=\"\",K13=\"\"),\"\",IF(J13=\"\",\"給気口\",INDEX(項目関係!$F$6:$F$44,MATCH(J13,項目関係!$G$6:$G$44,0))))","v":""}]
[null,null,null,null,"","","",null,{"$f":"IF(AND(J14=\"\",K14=\"\"),\"\",IF(J14=\"\",\"給気口\",INDEX(項目関係!$F$6:$F$44,MATCH(J14,項目関係!$G$6:$G$44,0))))","v":""}]
[null,null,null,null,"","","",null,{"$f":"IF(AND(J15=\"\",K15=\"\"),\"\",IF(J15=\"\",\"給気口\",INDEX(項目関係!$F$6:$F$44,MATCH(J15,項目関係!$G$6:$G$44,0))))","v":""}]
[null,null,null,null,"","","",null,{"$f":"IF(AND(J16=\"\",K16=\"\"),\"\",IF(J16=\"\",\"給気口\",INDEX(項目関係!$F$6:$F$44,MATCH(J16,項目関係!$G$6:$G$44,0))))","v":""}]
[null,null,null,null,"","","",null,{"$f":"IF(AND(J17=\"\",K17=\"\"),\"\",IF(J17=\"\",\"給気口\",INDEX(項目関係!$F$6:$F$44,MATCH(J17,項目関係!$G$6:$G$44,0))))","v":""}]
[null,null,null,null,"","","",null,{"$f":"IF(AND(J18=\"\",K18=\"\"),\"\",IF(J18=\"\",\"給気口\",INDEX(項目関係!$F$6:$F$44,MATCH(J18,項目関係!$G$6:$G$44,0))))","v":""}]
[null,null,null,null,"","","",null,{"$f":"IF(AND(J19=\"\",K19=\"\"),\"\",IF(J19=\"\",\"給気口\",INDEX(項目関係!$F$6:$F$44,MATCH(J19,項目関係!$G$6:$G$44,0))))","v":""}]
[null,null,null,null,"","","",null,{"$f":"IF(AND(J20=\"\",K20=\"\"),\"\",IF(J20=\"\",\"給気口\",INDEX(項目関係!$F$6:$F$44,MATCH(J20,項目関係!$G$6:$G$44,0))))","v":""}]
[null,null,null,null,"","","",null,{"$f":"IF(AND(J21=\"\",K21=\"\"),\"\",IF(J21=\"\",\"給気口\",INDEX(項目関係!$F$6:$F$44,MATCH(J21,項目関係!$G$6:$G$44,0))))","v":""}]
[null,null,null,null,"","","",null,{"$f":"IF(AND(J22=\"\",K22=\"\"),\"\",IF(J22=\"\",\"給気口\",INDEX(項目関係!$F$6:$F$44,MATCH(J22,項目関係!$G$6:$G$44,0))))","v":""}]
[null,null,null,null,"","","",null,{"$f":"IF(AND(J23=\"\",K23=\"\"),\"\",IF(J23=\"\",\"給気口\",INDEX(項目関係!$F$6:$F$44,MATCH(J23,項目関係!$G$6:$G$44,0))))","v":""}]
[null,null,null,null,"","","",null,{"$f":"IF(AND(J24=\"\",K24=\"\"),\"\",IF(J24=\"\",\"給気口\",INDEX(項目関係!$F$6:$F$44,MATCH(J24,項目関係!$G$6:$G$44,0))))","v":""}]
[null,null,null,null,"","","",null,{"$f":"IF(AND(J25=\"\",K25=\"\"),\"\",IF(J25=\"\",\"給気口\",INDEX(項目関係!$F$6:$F$44,MATCH(J25,項目関係!$G$6:$G$44,0))))","v":""}]
[null,null,null,null,"","","",null,{"$f":"IF(AND(J26=\"\",K26=\"\"),\"\",IF(J26=\"\",\"給気口\",INDEX(項目関係!$F$6:$F$44,MATCH(J26,項目関係!$G$6:$G$44,0))))","v":""}]
[null,null,null,null,"","","",null,{"$f":"IF(AND(J27=\"\",K27=\"\"),\"\",IF(J27=\"\",\"給気口\",INDEX(項目関係!$F$6:$F$44,MATCH(J27,項目関係!$G$6:$G$44,0))))","v":""}]
[null,null,null,null,"","","",null,{"$f":"IF(AND(J28=\"\",K28=\"\"),\"\",IF(J28=\"\",\"給気口\",INDEX(項目関係!$F$6:$F$44,MATCH(J28,項目関係!$G$6:$G$44,0))))","v":""}]
[null,null,null,null,"","","",null,{"$f":"IF(AND(J29=\"\",K29=\"\"),\"\",IF(J29=\"\",\"給気口\",INDEX(項目関係!$F$6:$F$44,MATCH(J29,項目関係!$G$6:$G$44,0))))","v":""}]
[null,null,null,null,"","","",null,{"$f":"IF(AND(J30=\"\",K30=\"\"),\"\",IF(J30=\"\",\"給気口\",INDEX(項目関係!$F$6:$F$44,MATCH(J30,項目関係!$G$6:$G$44,0))))","v":""}]
[null,null,null,null,"","","",null,{"$f":"IF(AND(J31=\"\",K31=\"\"),\"\",IF(J31=\"\",\"給気口\",INDEX(項目関係!$F$6:$F$44,MATCH(J31,項目関係!$G$6:$G$44,0))))","v":""}]
[null,null,null,null,"","","",null,{"$f":"IF(AND(J32=\"\",K32=\"\"),\"\",IF(J32=\"\",\"給気口\",INDEX(項目関係!$F$6:$F$44,MATCH(J32,項目関係!$G$6:$G$44,0))))","v":""}]
["合計",null,{"$f":"SUM(C10:C32)","v":0},null,{"$f":"SUM(E10:E32)","v":0},null,{"$f":"SUM(G10:G32)","v":0},null,null,null,{"$f":"SUM(K10:K32)","v":0},{"$f":"$K$33*25","v":0},{"$f":"$K$33*25","v":0}]
[null,null,null,null,null,null,null,null,"※上記計画換気量計算は、第一種換気の普通換気運転時を想定しています。"]
["換気量の判定",null,null,null,null,null,null,null,"※壁付第一種熱交換換気機(ツインエアーフレッシュLT-50シリーズ)を熱交換"]
[null,"必要換気量",null,{"$f":"G33","v":0},"㎥/ｈ",null,null,null,"※運転で使用した場合は、約70秒毎に排気と給気が入れ替わりますが、計画"]
[null,null,null,null,null,null,null,null,"※換気量は普通換気運転時と同一となります。"]
[null,"計画換気量",null,{"$f":"M33","v":0},"㎥/ｈ"]
[]
[null,"換気回数",null,{"$f":"M33/E33","v":{"$error":"#DIV/0!"}},"回/ｈ"]
[]
[null,"換気判定",null,{"$f":"IF(M33/E33>=0.5,\"○\",\"×\")","v":{"$error":"#DIV/0!"}}]
[]
[null,"　※判定説明【○：必要換気量を満足する　×：必要換気量を満足しない】"]
["※本資料は平成15年7月1日現在の建築基準法に準拠したものです。実際に申請、施工を行う際はその時点の建築基準法をご確認ください。"]
["※ダクトレスタイプの換気機は床下空間へは設置できませんので、当該部の換気を行う場合はダクト式の換気機を使用してください。"]
["※洗面室,トイレ等の水廻り空間を換気する場合は、別途局所換気設備を設けてください。"]
["※物入れ、押入れ等を換気区域から除外する場合は建具の構造を空気の流通のない物としてください。"]
["※床下、小屋裏空間の強制換気を行わない場合はホルムアルデヒド発散建材の種類、面積をご確認ください。"]
[]
[]
[]
["換気機各仕様"]
["機種",null,"換気風量 [m3/h]","制御方法","ｼｬｯﾀｰ有無","防火ﾀﾞﾝﾊﾟｰ","外部ﾌｰﾄﾞ色",null,null,null,"その他概要"]
[null,null," 3 / 2 / 1"]
["LT-50EcoS/W/B/CB",null,"50 / 30 / 15","ﾜｲﾔｰﾄﾞ壁ｽｲｯﾁ","無","無","ｽﾃﾝﾚｽ無塗装(S)/白(W)/黒(B)/茶(CB)",null,null,null,"ﾙｰﾊﾞｰｸﾞﾘﾙﾀｲﾌﾟ"]
["LT-50EcoSD/WD/BD/CBD",null,"50 / 30 / 15","ﾜｲﾔｰﾄﾞ壁ｽｲｯﾁ","無","有","ｽﾃﾝﾚｽ無塗装(S)/白(W)/黒(B)/茶(CB)",null,null,null,"ﾙｰﾊﾞｰｸﾞﾘﾙﾀｲﾌﾟ"]
["LT-50EcoSDF",null,"50 / 30 / 15","ﾜｲﾔｰﾄﾞ壁ｽｲｯﾁ","無","有","ｽﾃﾝﾚｽ無塗装(S)",null,null,null,"ﾙｰﾊﾞｰｸﾞﾘﾙﾀｲﾌﾟ/薄壁対応型"]
["LT-50EcoFlatS/W/B/CB",null,"50 / 30 / 15","ﾜｲﾔｰﾄﾞ壁ｽｲｯﾁ","無","無","ｽﾃﾝﾚｽ無塗装(S)/白(W)/黒(B)/茶(CB)",null,null,null,"ｲﾝﾃﾘｱﾊﾟﾈﾙﾀｲﾌﾟ"]
["LT-50EcoFlatSD/WD/BD/CBD",null,"50 / 30 / 15","ﾜｲﾔｰﾄﾞ壁ｽｲｯﾁ","無","有","ｽﾃﾝﾚｽ無塗装(S)/白(W)/黒(B)/茶(CB)",null,null,null,"ｲﾝﾃﾘｱﾊﾟﾈﾙﾀｲﾌﾟ"]
{"$rows_left_out":11}
{"sheet":"注意書","index":5,"n_rows":43,"n_cols":2,"rows_kept":43,"cut":false,"hidden":false,"merged":[[10,1,11,14],[0,0,0,14],[4,1,4,14],[5,1,5,14],[6,1,7,14],[9,1,9,14],[8,1,8,14],[20,1,20,14],[21,1,21,14],[26,1,27,14],[18,1,18,14],[22,1,23,14],[24,1,24,14],[25,1,25,14],[12,1,12,14],[13,1,14,14],[15,1,15,14],[16,1,17,14],[19,1,19,14],[54,1,57,14],[28,1,28,14],[29,1,29,14],[33,0,39,14],[42,1,45,14],[46,1,49,14],[50,1,53,14]]}
["ダクトレス換気システム　計画･設置時のポイント"]
[]
["□換気計画の概要と注意事項について"]
[]
["‣","弊社より提出する換気計画は参考資料となりますので、設計･施工時には建築士･設計者等と十分に確認をとって進めてください。"]
["‣","本換気計画は一般住宅(集合住宅、併用住宅も含む)を対象とし、弊社推奨のシステム部材構成で行っています。"]
["‣","本換気計画では、主に各居室を対象とし、全般換気用のダクトレス換気機で常時換気を行うよう計画します。居室以外の収納空間や水廻り空間を全般換気の対象へ含めない場合は、必要に応じて別途局所換気を計画してください。"]
[]
["‣","本換気計画で配置した換気機の設置位置は参考となりますので、当該室内での設置位置の変更や、位置の微調整は現地にて行ってください。"]
["‣","居室と廊下等の換気経路内にある室内の建具は、必ずアンダーカットやガラリを設け空気が流通するようにしてください。"]
["‣","ダクトレスタイプの換気機は床下空間等のメンテナンスが行いづらい場所への設置ができないため、基礎断熱工法等の場合に床下空間等を全般換気に含めて通風換気を行いたい場合は、弊社のLWZシリーズ等のダクト式の換気機をご採用ください。"]
[]
["‣","ダクトレス換気機を耐力壁面に設置する場合は、使用する構造用合板毎に定められた開口穴径や、開口位置を厳守してください。"]
["‣","地区計画等での指定がある場合や、延焼範囲内等の防火措置が必要な場所へダクトレス換気機を設置する場合は、防火ダンパー付タイプを採用してください。また、併せてオプションの金属製パイプを使用されることをおすすめいたします。"]
[]
["‣","ダクトレス換気機の設置位置は、清掃時などのメンテナンスの際に安全に作業できるよう、階段や吹抜から遠ざけて計画します。"]
["‣","ダクトレス換気機は、屋外の局所換気の排気口や給湯器等の空気の汚染源とは３メートル以上離して設置してください。また、地盤面からの湿気等を取り込む可能性があるため、地盤面より２メートル以上離した位置へ設置してください。"]
[]
["‣","ダクトレス換気機同士の給排気の短絡(ショートサーキット)を防ぐため、ダクトレス換気機同士をなるべく離して設置してください。"]
["‣","レンジフード等の局所換気は必ず同時給排タイプをご使用いただき、室内が極端に負圧にならないようにしてください。"]
["‣","ストーブや給湯器等の燃焼機器を室内に設置する際は、当該換気設備の影響を受けないよう、必ず密閉型の機器としてください。"]
["‣","ガス乾燥機等室内の空気で燃焼し、屋外に排気を行う機器を使用する場合は、窓を開ける等外気を取り入れながらご使用ください。"]
["‣","2階建を超える建物の場合や、外風の吹付の強い立地条件へのダクトレス換気機の設置は、外風の影響で機器の性能を発揮しない可能性がありますので、そのような懸念のある場合は、弊社のLWZシリーズ等のダクト式の全般換気をおすすめいたします。"]
[]
["‣","換気機本体やコントローラー及び、その信号線は、磁束、高調波等の影響を受けない場所へ取付並びに配線してください。"]
["‣","コントローラー～換気機間の信号線は、電源配線と一緒に引き回さないようにしてください。"]
["‣","LT-50Eco/Flat/SDF各タイプのコントローラーは、非接触の静電スイッチ式のためドアの開閉などでコントローラー前面に物体が近接すると誤操作となる場合があるため、ドアや冷蔵庫等の開閉時にコントローラー前面に物体が近接しない場所へコントローラーを設置してください。"]
[]
["‣","LT-50Eco/Flat/SDF各タイプのコントローラーは、運転状態を常時青色ランプで表示しますので、明るさが問題とならない位置へ設置してください。"]
["‣","製品やシステムを構成する機材の仕様や定格は、改良のため変更する事が有りますので、ご了承願います。"]
[]
["□今回の換気計画においてご留意いただきたい事項について"]
[]
[]
[]
[]
[]
[]
[]
[]
[]
[null,"定形コメント"]
[null,"常時換気機から局所換気の排気を取り込む(ショートサーキット)事を防ぐため、局所換気の排気口を常時換気の設置のある壁面と異なる外壁面へ設置してください。"]

{"sheet":"配線図","index":6,"n_rows":40,"n_cols":15,"rows_kept":40,"cut":false,"hidden":true,"merged":[[33,6,33,11],[34,6,34,11],[35,6,35,11],[29,6,29,8],[37,1,37,5],[38,1,38,5],[39,1,39,11],[36,6,36,8],[36,9,36,11],[37,6,37,11],[38,6,38,8],[38,9,38,11],[1,1,2,17],[34,4,34,5],[35,4,35,5],[36,4,36,5],[29,9,29,11],[36,1,36,3],[29,1,29,5],[30,1,30,5],[31,1,31,5],[32,1,32,5],[33,1,33,5],[34,1,34,3],[35,1,35,3],[30,6,30,11],[31,6,31,11],[32,6,32,11]]}
[]
[null,"換気システム設計参考資料"]
[]
[]
[null,"□　仕　様　図",null,null,null,null,null,null,null,null,null,null,null,"□　電　気　配　線　例"]
[]
[]
[]
[]
[]
[]
[]
[]
[]
[]
[]
[]
[]
[]
[]
[]
[]
[]
[]
[]
[]
[null,null,null,null,null,null,null,null,null,null,null,null,null,"□　備　考"]
[]
[null,null,null,null,null,null,null,null,null,null,null,null,null,"・","確認申請時の書式は、当該地域ごとに定められたものをご使用ください。"]
[null,"型式",null,null,null,null,"LA60A",null,null,"LA60U",null,null,null,"・","当計算書は、貴社情報による参考資料です。実際の計画時は建築士と十分な打ち合わせを行って進めてください。"]
[null,"風量",null,null,null,null,"30-60㎥/ｈ",null,null,null,null,null,null,"・","当計算結果は、施工条件、空気条件などによって変化しますので、実際の換気量とは異なります。"]
[null,"静圧",null,null,null,null,"210Pa",null,null,null,null,null,null,"・","当計算書は参考資料となりますので、部材配置等は現場にて打ち合わせを行い、配置してください。"]
[null,"消費電力",null,null,null,null,"11W",null,null,null,null,null,null,"・","換気経路にある扉※1は、高さ1ｃｍ程度のアンダーカットや、ガラリを設ける事により、必要な通気を確保してください。"]
[null,"騒音値",null,null,null,null,"37ｄB",null,null,null,null,null,null,"・","当換気システムは、必ず常時連続運転をおこなってください。"]
[null,"寸法",null,null,"H",null,"260mm",null,null,null,null,null,null,"・","台所及び、浴室の局所換気設備は、別途手配となります。"]
[null,null,null,null,"W",null,"260mm",null,null,null,null,null,null,"・","台所に設置される局所換気設備は、同時給排型又は、専用の給気口と連動できるものとしてください。"]
[null,null,null,null,"D",null,"108mm",null,null,"128mm",null,null,null,"・","浴室に設置される局所換気設備は、運転停止時にシャッターが閉止するものとしてください。"]
[null,"ダクト接続口径",null,null,null,null,"75-80mm",null,null,null,null,null,null,"・","防火地域や、準防火地域に該当する場合や、延焼の恐れのある部分の外部フードは、防火ダンパー付としてください。"]
[null,"重量",null,null,null,null,"2.7kg",null,null,"3.2kg",null,null,null,null,"※1：一般的な折れ戸や引き戸など比較的隙間が多きい扉は、そのままでも換気経路として有効となります。"]
[null,"※消費電力、騒音値は最大ノッチ運転時の値"]

{"sheet":"項目関係","index":7,"n_rows":44,"n_cols":13,"rows_kept":44,"cut":false,"hidden":true,"merged":[[2,10,2,12],[2,5,2,8],[2,1,2,3]]}
[]
[]
[null,"給気機材",null,null,null,"排気機材",null,null,null,null,"フード機種"]
[null,"品名","型番","金額",null,"品名","型番","排気側風量",null,null,"品名","型番","金額"]
[]
[null,"自然給気口","ST-V41PS-SG",6850,null,"換気機","LT-50EcoS/W/B/CB",null,null,null,"樹脂製フード","(ST-V41PS-SG)"]
[null,"自然給気口","ST-V41PS-CG",6850,null,"換気機","LT-50EcoSD/WD/BD/CBD",null,null,null,"樹脂製フード","(ST-V41PS-CG)"]
[null,null,null,null,null,"換気機","LT-50EcoSDF",null,null,null,"SUS製フード","ST-8820SH",5020]
[null,null,null,null,null,"換気機","LT-50EcoFlatS/W/B/CB",null,null,null,"SUS製フード","ST-8820SH-MLG",6220]
[null,null,null,null,null,"換気機","LT-50EcoFlatSD/WD/BD/CBD",null,null,null,"SUS製フード(FD)","ST-8820SHD",7020]
[null,null,null,null,null,"換気機","LT-50EcoFlatSDF",null,null,null,"SUS製フード(FD)","ST-8820SHD-MLG",8220]
[null,null,null,null,null,"換気機","LT-50EcoSlimSK/WK/BK/CBK",null,null,null,"SUS製排気フード","ST-8820SHE",7320]
[null,null,null,null,null,"換気機","LT-50EcoSlimSDK/WDK/BDK/CBDK",null,null,null,"SUS製排気フード","ST-8820SHE-MLG",8946]
[null,null,null,null,null,"換気機","LT-50EcoSlimSDF",null,null,null,"SUS製排気フード(FD)","ST-8820SHED",9320]
[null,null,null,null,null,"換気機","LT-50ProS/W/B/CB",null,null,null,"SUS製排気フード(FD)","ST-8820SHED-MLG",10520]
[null,null,null,null,null,"換気機","LT-50ProSD/WD/BD/CBD"]
[null,null,null,null,null,"換気機","LT-50ProSDF"]
[null,null,null,null,null,"換気機","LT-50SmartSK/WK/BK/CBK"]
[null,null,null,null,null,"換気機","LT-50SmartSDK/WDK/BDK/CBDK"]
[null,null,null,null,null,"換気機","LT-50SmartSDF"]
[null,null,null,null,null,"換気機"]
[null,null,null,null,null,"換気機"]
[null,null,null,null,null,"換気機"]
[null,null,null,null,null,"換気機"]
[null,null,null,null,null,"換気機"]
[null,null,null,null,null,"換気機"]
[null,null,null,null,null,"換気機"]
[null,null,null,null,null,"換気機"]
[null,null,null,null,null,"換気機"]
[null,null,null,null,null,"換気機"]
[null,null,null,null,null,"換気機"]
[null,null,null,null,null,"換気機"]
[null,null,null,null,null,"換気機"]
[]
[]
[]
[]
[]
[]
[]
[]
[]
[null,null,null,null,null,"換気機","V-12ZMC6",65]
[null,null,null,null,null,"給気口"]